Reaction Details
Target5-hydroxytryptamine receptor 1A
LigandBDBM50262881
Substrate/Competitorn/a
Meas. Tech.ChEMBL_490812 (CHEMBL992749)
Ki 37.6±n/a nM
Citation Ablordeppey, SYAltundas, RBricker, BZhu, XYKumar, EVJackson, TKhan, ARoth, BL Identification of a butyrophenone analog as a potential atypical antipsychotic agent: 4-[4-(4-chlorophenyl)-1,4-diazepan-1-yl]-1-(4-fluorophenyl)butan-1-one. Bioorg Med Chem16:7291-301 (2008) 
 
5-hydroxytryptamine receptor 1A
Name:5-hydroxytryptamine receptor 1A
Type:n/a
Mol. Mass.:46122.49
Organism:Homo sapiens (Human)
Description:n/a
Residue:422
BDBM50262881
NameBDBM50262881
Synonyms:1-(4-fluorophenyl)-4-(3-hydroxy-3-phenyl-8-aza-bicyclo[3.2.1]octan-8-yl)butan-1-one | CHEMBL478617
TypeSmall organic molecule
Emp. Form.C23H26FNO2
Mol. Mass.367.4564
SMILESOC1(CC2CCC(C1)N2CCCC(=O)c1ccc(F)cc1)c1ccccc1