Reaction Details
Target5-hydroxytryptamine receptor 2A
LigandBDBM50262881
Substrate/Competitorn/a
Meas. Tech.ChEMBL_490813 (CHEMBL992750)
Ki 12.3±n/a nM
Citation Ablordeppey, SYAltundas, RBricker, BZhu, XYKumar, EVJackson, TKhan, ARoth, BL Identification of a butyrophenone analog as a potential atypical antipsychotic agent: 4-[4-(4-chlorophenyl)-1,4-diazepan-1-yl]-1-(4-fluorophenyl)butan-1-one. Bioorg Med Chem16:7291-301 (2008) 
 
5-hydroxytryptamine receptor 2A
Name:5-hydroxytryptamine receptor 2A
Type:undefined
Mol. Mass.:52607.65
Organism:Homo sapiens (Human)
Description:P28223
Residue:471
BDBM50262881
NameBDBM50262881
Synonyms:1-(4-fluorophenyl)-4-(3-hydroxy-3-phenyl-8-aza-bicyclo[3.2.1]octan-8-yl)butan-1-one | CHEMBL478617
TypeSmall organic molecule
Emp. Form.C23H26FNO2
Mol. Mass.367.4564
SMILESOC1(CC2CCC(C1)N2CCCC(=O)c1ccc(F)cc1)c1ccccc1