Reaction Details
TargetD(2) dopamine receptor
LigandBDBM35254
Substrate/Competitorn/a
Meas. Tech.ChEMBL_490806 (CHEMBL992743)
Ki 20±n/a nM
Citation Ablordeppey, SYAltundas, RBricker, BZhu, XYKumar, EVJackson, TKhan, ARoth, BL Identification of a butyrophenone analog as a potential atypical antipsychotic agent: 4-[4-(4-chlorophenyl)-1,4-diazepan-1-yl]-1-(4-fluorophenyl)butan-1-one. Bioorg Med Chem16:7291-301 (2008) 
 
D(2) dopamine receptor
Name:D(2) dopamine receptor
Type:Cell-surface receptors
Mol. Mass.:50647.10
Organism:Homo sapiens (Human)
Description:P14416
Residue:443
BDBM35254
NameBDBM35254
Synonyms:2-methyl-4-(4-methylpiperazin-1-yl)-10H-thieno[2,3-b][1,5]benzodiazepine Olansek Zyprexa | olanzapine
TypeSmall organic molecule
Emp. Form.C17H20N4S
Mol. Mass.312.432
SMILESCN1CCN(CC1)C1=Nc2ccccc2Nc2sc(C)cc12