Reaction Details
TargetD(4) dopamine receptor
LigandBDBM50185473
Substrate/Competitorn/a
Meas. Tech.ChEMBL_490808 (CHEMBL992745)
Ki 5.3±n/a nM
Citation Ablordeppey, SYAltundas, RBricker, BZhu, XYKumar, EVJackson, TKhan, ARoth, BL Identification of a butyrophenone analog as a potential atypical antipsychotic agent: 4-[4-(4-chlorophenyl)-1,4-diazepan-1-yl]-1-(4-fluorophenyl)butan-1-one. Bioorg Med Chem16:7291-301 (2008) 
 
D(4) dopamine receptor
Name:D(4) dopamine receptor
Type:Enzyme
Mol. Mass.:48373.19
Organism:Homo sapiens (Human)
Description:P21917
Residue:419
BDBM50185473
NameBDBM50185473
Synonyms:4-(3-(4-chlorophenyl)-3-hydroxy-8-aza-bicyclo[3.2.1]octan-8-yl)-1-(4-fluorophenyl)butan-1-one 4-[3-(4-Chlorophenyl)-3-hydroxy-8-azabicyclo[3.2.1]oct-8-yl]-1-(4-fluorophenyl)butan-1-one | CHEMBL210578
TypeSmall organic molecule
Emp. Form.C23H25ClFNO2
Mol. Mass.401.902
SMILESOC1(CC2CCC(C1)N2CCCC(=O)c1ccc(F)cc1)c1ccc(Cl)cc1