Reaction Details
Target5-hydroxytryptamine receptor 1A
LigandBDBM50263290
Substrate/Competitorn/a
Meas. Tech.ChEMBL_491031 (CHEMBL982079)
Ki 0.29±n/a nM
Citation Siracusa, MASalerno, LModica, MNPittalà, VRomeo, GAmato, MENowak, MBojarski, AJMereghetti, ICagnotto, AMennini, T Synthesis of new arylpiperazinylalkylthiobenzimidazole, benzothiazole, or benzoxazole derivatives as potent and selective 5-HT1A serotonin receptor ligands. J Med Chem51:4529-38 (2008) 
 
5-hydroxytryptamine receptor 1A
Name:5-hydroxytryptamine receptor 1A
Type:G Protein-Coupled Receptor (GPCR)
Mol. Mass.:46445.29
Organism:Rattus norvegicus (rat)
Description:Binding assays were performed using rat hippocampal membranes.
Residue:422
BDBM50263290
NameBDBM50263290
Synonyms:2-[[3-[4-(2-Methoxyphenyl)-1-piperazinyl]propyl]thio]benzothiazole | CHEMBL477200
TypeSmall organic molecule
Emp. Form.C21H25N3OS2
Mol. Mass.399.573
SMILESCOc1ccccc1N1CCN(CCCSc2nc3ccccc3s2)CC1