Reaction Details
TargetProstaglandin G/H synthase 1
LigandBDBM13063
Substrate/Competitorn/a
Meas. Tech.ChEMBL_488813 (CHEMBL985693)
IC50 34300±n/a nM
Citation Anzini, MRovini, MCappelli, AVomero, SManetti, FBotta, MSautebin, LRossi, APergola, CGhelardini, CNorcini, MGiordani, AMakovec, FAnzellotti, PPatrignani, PBiava, M Synthesis, biological evaluation, and enzyme docking simulations of 1,5-diarylpyrrole-3-alkoxyethyl ethers as selective cyclooxygenase-2 inhibitors endowed with anti-inflammatory and antinociceptive activity. J Med Chem51:4476-81 (2008) 
 
Prostaglandin G/H synthase 1
Name:Prostaglandin G/H synthase 1
Type:Enzyme
Mol. Mass.:68692.62
Organism:Homo sapiens (Human)
Description:P23219
Residue:599
BDBM13063
NameBDBM13063
Synonyms:4-(5-methyl-3-phenyl-1,2-oxazol-4-yl)benzene-1-sulfonamide CHEMBL865 Valdecoxib | cid_119607
TypeSmall organic molecule
Emp. Form.C16H14N2O3S
Mol. Mass.314.359
SMILESCc1onc(c1-c1ccc(cc1)S(N)(=O)=O)-c1ccccc1