Reaction Details
TargetProstaglandin G/H synthase 2
LigandBDBM50166278
Substrate/Competitorn/a
Meas. Tech.ChEMBL_488807 (CHEMBL985687)
IC50 40±n/a nM
Citation Anzini, MRovini, MCappelli, AVomero, SManetti, FBotta, MSautebin, LRossi, APergola, CGhelardini, CNorcini, MGiordani, AMakovec, FAnzellotti, PPatrignani, PBiava, M Synthesis, biological evaluation, and enzyme docking simulations of 1,5-diarylpyrrole-3-alkoxyethyl ethers as selective cyclooxygenase-2 inhibitors endowed with anti-inflammatory and antinociceptive activity. J Med Chem51:4476-81 (2008) 
 
Prostaglandin G/H synthase 2
Name:Prostaglandin G/H synthase 2
Type:Protein
Mol. Mass.:69020.39
Organism:Mus musculus (Mouse)
Description:Q05769
Residue:604
BDBM50166278
NameBDBM50166278
Synonyms:CHEMBL191941 ethyl 2-(2-methyl-5-(4-(methylsulfonyl)phenyl)-1-phenyl-1H-pyrrol-3-yl)acetate
TypeSmall organic molecule
Emp. Form.C22H23NO4S
Mol. Mass.397.487
SMILESCCOC(=O)Cc1cc(-c2ccc(cc2)S(C)(=O)=O)n(c1C)-c1ccccc1