Reaction Details
TargetProstaglandin G/H synthase 2
LigandBDBM50262990
Substrate/Competitorn/a
Meas. Tech.ChEMBL_488807 (CHEMBL985687)
IC50 18±n/a nM
Citation Anzini, MRovini, MCappelli, AVomero, SManetti, FBotta, MSautebin, LRossi, APergola, CGhelardini, CNorcini, MGiordani, AMakovec, FAnzellotti, PPatrignani, PBiava, M Synthesis, biological evaluation, and enzyme docking simulations of 1,5-diarylpyrrole-3-alkoxyethyl ethers as selective cyclooxygenase-2 inhibitors endowed with anti-inflammatory and antinociceptive activity. J Med Chem51:4476-81 (2008) 
 
Prostaglandin G/H synthase 2
Name:Prostaglandin G/H synthase 2
Type:Protein
Mol. Mass.:69020.39
Organism:Mus musculus (Mouse)
Description:Q05769
Residue:604
BDBM50262990
NameBDBM50262990
Synonyms:CHEMBL517675 | [2-Methyl-5-(4-methylsulphonyl)phenyl-1-phenyl-3-(2-n-propyloxyethyl)]-1H-pyrrole
TypeSmall organic molecule
Emp. Form.C23H27NO3S
Mol. Mass.397.53
SMILESCCCOCCc1cc(-c2ccc(cc2)S(C)(=O)=O)n(c1C)-c1ccccc1