Reaction Details
TargetProstaglandin G/H synthase 2
LigandBDBM50262934
Substrate/Competitorn/a
Meas. Tech.ChEMBL_488807 (CHEMBL985687)
IC50 15±n/a nM
Citation Anzini, MRovini, MCappelli, AVomero, SManetti, FBotta, MSautebin, LRossi, APergola, CGhelardini, CNorcini, MGiordani, AMakovec, FAnzellotti, PPatrignani, PBiava, M Synthesis, biological evaluation, and enzyme docking simulations of 1,5-diarylpyrrole-3-alkoxyethyl ethers as selective cyclooxygenase-2 inhibitors endowed with anti-inflammatory and antinociceptive activity. J Med Chem51:4476-81 (2008) 
 
Prostaglandin G/H synthase 2
Name:Prostaglandin G/H synthase 2
Type:Protein
Mol. Mass.:69020.39
Organism:Mus musculus (Mouse)
Description:Q05769
Residue:604
BDBM50262934
NameBDBM50262934
Synonyms:CHEMBL477362 | [3-(2-Ethoxyethyl)-2-methyl-5-(4-methylsulphonyl)phenyl-1-phenyl]-1H-pyrrole
TypeSmall organic molecule
Emp. Form.C22H25NO3S
Mol. Mass.383.504
SMILESCCOCCc1cc(-c2ccc(cc2)S(C)(=O)=O)n(c1C)-c1ccccc1