Reaction Details
TargetHistamine H3 receptor
LigandBDBM50262939
Substrate/Competitorn/a
Meas. Tech.ChEMBL_489015 (CHEMBL986356)
Ki 33±n/a nM
Citation Nagase, TMizutani, TIshikawa, SSekino, ESasaki, TFujimura, TIto, SMitobe, YMiyamoto, YYoshimoto, RTanaka, TIshihara, ATakenaga, NTokita, SFukami, TSato, N Synthesis, structure-activity relationships, and biological profiles of a quinazolinone class of histamine H3 receptor inverse agonists. J Med Chem51:4780-9 (2008) 
 
Histamine H3 receptor
Name:Histamine H3 receptor
Type:G Protein-Coupled Receptor (GPCR)
Mol. Mass.:48607.98
Organism:Rattus norvegicus (rat)
Description:n/a
Residue:445
BDBM50262939
NameBDBM50262939
Synonyms:2-Methyl-3-(4-{[3-(1-pyrrolidinyl)propyl]oxy}phenyl)-5-(trifluoromethyl)-4(3H)-quinazolinone | CHEMBL476323
TypeSmall organic molecule
Emp. Form.C23H24F3N3O2
Mol. Mass.431.4508
SMILESCc1nc2cccc(c2c(=O)n1-c1ccc(OCCCN2CCCC2)cc1)C(F)(F)F