Reaction Details
TargetHistamine H3 receptor
LigandBDBM50262885
Substrate/Competitorn/a
Meas. Tech.ChEMBL_489014 (CHEMBL986355)
IC50 1.6±n/a nM
Citation Nagase, TMizutani, TIshikawa, SSekino, ESasaki, TFujimura, TIto, SMitobe, YMiyamoto, YYoshimoto, RTanaka, TIshihara, ATakenaga, NTokita, SFukami, TSato, N Synthesis, structure-activity relationships, and biological profiles of a quinazolinone class of histamine H3 receptor inverse agonists. J Med Chem51:4780-9 (2008) 
 
Histamine H3 receptor
Name:Histamine H3 receptor
Type:G Protein-Coupled Receptor (GPCR)
Mol. Mass.:48691.47
Organism:Homo sapiens (Human)
Description:Binding assays were using CHO cells stably expressing hH3R receptors.
Residue:445
BDBM50262885
NameBDBM50262885
Synonyms:6-Fluoro-2-methyl-3-(4-{[3-(1-pyrrolidinyl)propyl]oxy}phenyl)-4(3H)-quinazolinone | CHEMBL479252
TypeSmall organic molecule
Emp. Form.C22H24FN3O2
Mol. Mass.381.4433
SMILESCc1nc2ccc(F)cc2c(=O)n1-c1ccc(OCCCN2CCCC2)cc1