Reaction Details
TargetHistamine H3 receptor
LigandBDBM50262883
Substrate/Competitorn/a
Meas. Tech.ChEMBL_489014 (CHEMBL986355)
IC50 3.7±n/a nM
Citation Nagase, TMizutani, TIshikawa, SSekino, ESasaki, TFujimura, TIto, SMitobe, YMiyamoto, YYoshimoto, RTanaka, TIshihara, ATakenaga, NTokita, SFukami, TSato, N Synthesis, structure-activity relationships, and biological profiles of a quinazolinone class of histamine H3 receptor inverse agonists. J Med Chem51:4780-9 (2008) 
 
Histamine H3 receptor
Name:Histamine H3 receptor
Type:G Protein-Coupled Receptor (GPCR)
Mol. Mass.:48691.47
Organism:Homo sapiens (Human)
Description:Binding assays were using CHO cells stably expressing hH3R receptors.
Residue:445
BDBM50262883
NameBDBM50262883
Synonyms:8-Methoxy-2-methyl-3-(4-{[3-(1-pyrrolidinyl)propyl]oxy}phenyl)-4(3H)-quinazolinone trifluoroacetate | CHEMBL477152
TypeSmall organic molecule
Emp. Form.C23H27N3O3
Mol. Mass.393.4788
SMILESCOc1cccc2c1nc(C)n(-c1ccc(OCCCN3CCCC3)cc1)c2=O