Reaction Details
TargetPotassium voltage-gated channel subfamily H member 2
LigandBDBM50262795
Substrate/Competitorn/a
Meas. Tech.ChEMBL_489010 (CHEMBL986351)
IC50 6600±n/a nM
Citation Nagase, TMizutani, TIshikawa, SSekino, ESasaki, TFujimura, TIto, SMitobe, YMiyamoto, YYoshimoto, RTanaka, TIshihara, ATakenaga, NTokita, SFukami, TSato, N Synthesis, structure-activity relationships, and biological profiles of a quinazolinone class of histamine H3 receptor inverse agonists. J Med Chem51:4780-9 (2008) 
 
Potassium voltage-gated channel subfamily H member 2
Name:Potassium voltage-gated channel subfamily H member 2
Type:Multi-pass membrane protein
Mol. Mass.:126672.65
Organism:Homo sapiens (Human)
Description:Q12809
Residue:1159
BDBM50262795
NameBDBM50262795
Synonyms:2,5-Dimethyl-3-(4-{[3-(1-pyrrolidinyl)propyl]oxy}phenyl)-4(3H)-quinazolinone | CHEMBL479242
TypeSmall organic molecule
Emp. Form.C23H27N3O2
Mol. Mass.377.4794
SMILESCc1cccc2nc(C)n(-c3ccc(OCCCN4CCCC4)cc3)c(=O)c12