Reaction Details
TargetLysosomal alpha-mannosidase
LigandBDBM50263050
Substrate/Competitorn/a
Meas. Tech.ChEMBL_489067 (CHEMBL987287)
IC50 750000±n/a nM
Citation Fiaux, HKuntz, DAHoffman, DJanzer, RCGerber-Lemaire, SRose, DRJuillerat-Jeanneret, L Functionalized pyrrolidine inhibitors of human type II alpha-mannosidases as anti-cancer agents: optimizing the fit to the active site. Bioorg Med Chem16:7337-46 (2008) 
 
Lysosomal alpha-mannosidase
Name:Lysosomal alpha-mannosidase
Type:PROTEIN
Mol. Mass.:113753.32
Organism:Homo sapiens (Human)
Description:ChEMBL_1432452
Residue:1011
BDBM50263050
NameBDBM50263050
Synonyms:(R)-2-(((2R,3R,4R)-3,4-dihydroxy-5-oxopyrrolidin-2-yl)methylamino)-2-phenylethyl 4-bromobenzoate | CHEMBL476927
TypeSmall organic molecule
Emp. Form.C20H21BrN2O5
Mol. Mass.449.295
SMILESO[C@@H]1[C@@H](CN[C@@H](COC(=O)c2ccc(Br)cc2)c2ccccc2)NC(=O)[C@@H]1O