Reaction Details
TargetLysosomal alpha-mannosidase
LigandBDBM50263049
Substrate/Competitorn/a
Meas. Tech.ChEMBL_489068 (CHEMBL987288)
IC50 500±n/a nM
Citation Fiaux, HKuntz, DAHoffman, DJanzer, RCGerber-Lemaire, SRose, DRJuillerat-Jeanneret, L Functionalized pyrrolidine inhibitors of human type II alpha-mannosidases as anti-cancer agents: optimizing the fit to the active site. Bioorg Med Chem16:7337-46 (2008) 
 
Lysosomal alpha-mannosidase
Name:Lysosomal alpha-mannosidase
Type:PROTEIN
Mol. Mass.:113753.32
Organism:Homo sapiens (Human)
Description:ChEMBL_1432452
Residue:1011
BDBM50263049
NameBDBM50263049
Synonyms:(3R,4R,5R)-3,4-dihydroxy-5-(((R)-2-hydroxy-1-phenylethylamino)methyl)-1-methylpyrrolidin-2-one CHEMBL476926
TypeSmall organic molecule
Emp. Form.C14H20N2O4
Mol. Mass.280.3196
SMILESCN1[C@H](CN[C@@H](CO)c2ccccc2)[C@@H](O)[C@@H](O)C1=O