Reaction Details
TargetLysosomal alpha-mannosidase
LigandBDBM50168988
Substrate/Competitorn/a
Meas. Tech.ChEMBL_489066 (CHEMBL987286)
Ki 41500±n/a nM
Citation Fiaux, HKuntz, DAHoffman, DJanzer, RCGerber-Lemaire, SRose, DRJuillerat-Jeanneret, L Functionalized pyrrolidine inhibitors of human type II alpha-mannosidases as anti-cancer agents: optimizing the fit to the active site. Bioorg Med Chem16:7337-46 (2008) 
 
Lysosomal alpha-mannosidase
Name:Lysosomal alpha-mannosidase
Type:PROTEIN
Mol. Mass.:113753.32
Organism:Homo sapiens (Human)
Description:ChEMBL_1432452
Residue:1011
BDBM50168988
NameBDBM50168988
Synonyms:(2R,3R,4S)-2-({[(1R)-2-HYDROXY-1-PHENYLETHYL]AMINO}METHYL)PYRROLIDINE-3,4-DIOL | CHEMBL425723
TypeSmall organic molecule
Emp. Form.C13H20N2O3
Mol. Mass.252.3095
SMILESOC[C@H](NC[C@H]1NC[C@H](O)[C@@H]1O)c1ccccc1