Reaction Details
TargetD(4) dopamine receptor
LigandBDBM50086065
Substrate/Competitorn/a
Meas. Tech.ChEMBL_488689 (CHEMBL988379)
IC50>1000±n/a nM
Citation Park, CMKim, SYPark, WKPark, NSSeong, CM Synthesis and structure-activity relationship of 1H-indole-3-carboxylic acid pyridine-3-ylamides: a novel series of 5-HT2C receptor antagonists. Bioorg Med Chem Lett18:3844-7 (2008) 
 
D(4) dopamine receptor
Name:D(4) dopamine receptor
Type:Enzyme
Mol. Mass.:48373.19
Organism:Homo sapiens (Human)
Description:P21917
Residue:419
BDBM50086065
NameBDBM50086065
Synonyms:5-Methyl-6-trifluoromethyl-2,3-dihydro-indole-1-carboxylic acid [6-(2-methyl-pyridin-3-yloxy)-pyridin-3-yl]-amide CHEMBL14460 | SB-243213
TypeSmall organic molecule
Emp. Form.C22H19F3N4O2
Mol. Mass.428.4071
SMILESCc1cc2CCN(C(=O)Nc3ccc(Oc4cccnc4C)nc3)c2cc1C(F)(F)F