Reaction Details
TargetMitogen-activated protein kinase 14
LigandBDBM50263296
Substrate/Competitorn/a
Meas. Tech.ChEMBL_489078 (CHEMBL987298)
Ki 11±n/a nM
Citation Angell, RMAngell, TDBamborough, PBamford, MJChung, CWCockerill, SGFlack, SSJones, KLLaine, DILongstaff, TLudbrook, SPearson, RSmith, KJSmee, PASomers, DOWalker, AL Biphenyl amide p38 kinase inhibitors 4: DFG-in and DFG-out binding modes. Bioorg Med Chem Lett18:4433-7 (2008) 
 
Mitogen-activated protein kinase 14
Name:Mitogen-activated protein kinase 14
Type:Serine/threonine-protein kinase
Mol. Mass.:41286.76
Organism:Homo sapiens (Human)
Description:Q16539
Residue:360
BDBM50263296
NameBDBM50263296
Synonyms:6-Methyl-biphenyl-3,4'-dicarboxylic acid 4'-[(3-cyano-phenyl)-amide] 3-[(3-pyridin-2-yl-phenyl)-amide] | CHEMBL514509
TypeSmall organic molecule
Emp. Form.C33H24N4O2
Mol. Mass.508.5693
SMILESCc1ccc(cc1-c1ccc(cc1)C(=O)Nc1cccc(c1)C#N)C(=O)Nc1cccc(c1)-c1ccccn1