Reaction Details
TargetMitogen-activated protein kinase 14
LigandBDBM50263260
Substrate/Competitorn/a
Meas. Tech.ChEMBL_489078 (CHEMBL987298)
Ki 2.1±n/a nM
Citation Angell, RMAngell, TDBamborough, PBamford, MJChung, CWCockerill, SGFlack, SSJones, KLLaine, DILongstaff, TLudbrook, SPearson, RSmith, KJSmee, PASomers, DOWalker, AL Biphenyl amide p38 kinase inhibitors 4: DFG-in and DFG-out binding modes. Bioorg Med Chem Lett18:4433-7 (2008) 
 
Mitogen-activated protein kinase 14
Name:Mitogen-activated protein kinase 14
Type:Serine/threonine-protein kinase
Mol. Mass.:41286.76
Organism:Homo sapiens (Human)
Description:Q16539
Residue:360
BDBM50263260
NameBDBM50263260
Synonyms:5'-[3-(2,5-Dimethyl-pyrrol-1-yl)-benzoylamino]-2'-methyl-biphenyl-4-carboxylic acid cyclopropylmethyl-amide | CHEMBL476995
TypeSmall organic molecule
Emp. Form.C31H31N3O2
Mol. Mass.477.5967
SMILESCc1ccc(C)n1-c1cccc(c1)C(=O)Nc1ccc(C)c(c1)-c1ccc(cc1)C(=O)NCC1CC1