Reaction Details
TargetMitogen-activated protein kinase 14
LigandBDBM50263129
Substrate/Competitorn/a
Meas. Tech.ChEMBL_489078 (CHEMBL987298)
Ki 1.9±n/a nM
Citation Angell, RMAngell, TDBamborough, PBamford, MJChung, CWCockerill, SGFlack, SSJones, KLLaine, DILongstaff, TLudbrook, SPearson, RSmith, KJSmee, PASomers, DOWalker, AL Biphenyl amide p38 kinase inhibitors 4: DFG-in and DFG-out binding modes. Bioorg Med Chem Lett18:4433-7 (2008) 
 
Mitogen-activated protein kinase 14
Name:Mitogen-activated protein kinase 14
Type:Serine/threonine-protein kinase
Mol. Mass.:41286.76
Organism:Homo sapiens (Human)
Description:Q16539
Residue:360
BDBM50263129
NameBDBM50263129
Synonyms:CHEMBL477182 | N-[4'-(Cyclopropylmethyl-carbamoyl)-6-methyl-biphenyl-3-yl]-2-pyrrolidin-1-yl-isonicotinamide
TypeSmall organic molecule
Emp. Form.C28H30N4O2
Mol. Mass.454.5634
SMILESCc1ccc(NC(=O)c2ccnc(c2)N2CCCC2)cc1-c1ccc(cc1)C(=O)NCC1CC1