Reaction Details
TargetMitogen-activated protein kinase 14
LigandBDBM50263128
Substrate/Competitorn/a
Meas. Tech.ChEMBL_489078 (CHEMBL987298)
Ki 14±n/a nM
Citation Angell, RMAngell, TDBamborough, PBamford, MJChung, CWCockerill, SGFlack, SSJones, KLLaine, DILongstaff, TLudbrook, SPearson, RSmith, KJSmee, PASomers, DOWalker, AL Biphenyl amide p38 kinase inhibitors 4: DFG-in and DFG-out binding modes. Bioorg Med Chem Lett18:4433-7 (2008) 
 
Mitogen-activated protein kinase 14
Name:Mitogen-activated protein kinase 14
Type:Serine/threonine-protein kinase
Mol. Mass.:41286.76
Organism:Homo sapiens (Human)
Description:Q16539
Residue:360
BDBM50263128
NameBDBM50263128
Synonyms:CHEMBL515318 | N-[4'-(Cyclopropylmethyl-carbamoyl)-6-methyl-biphenyl-3-yl]-2-dimethylamino-isonicotinamide
TypeSmall organic molecule
Emp. Form.C26H28N4O2
Mol. Mass.428.5261
SMILESCN(C)c1cc(ccn1)C(=O)Nc1ccc(C)c(c1)-c1ccc(cc1)C(=O)NCC1CC1