Reaction Details
TargetMitogen-activated protein kinase 14
LigandBDBM50262822
Substrate/Competitorn/a
Meas. Tech.ChEMBL_489078 (CHEMBL987298)
Ki 12±n/a nM
Citation Angell, RMAngell, TDBamborough, PBamford, MJChung, CWCockerill, SGFlack, SSJones, KLLaine, DILongstaff, TLudbrook, SPearson, RSmith, KJSmee, PASomers, DOWalker, AL Biphenyl amide p38 kinase inhibitors 4: DFG-in and DFG-out binding modes. Bioorg Med Chem Lett18:4433-7 (2008) 
 
Mitogen-activated protein kinase 14
Name:Mitogen-activated protein kinase 14
Type:Serine/threonine-protein kinase
Mol. Mass.:41286.76
Organism:Homo sapiens (Human)
Description:Q16539
Residue:360
BDBM50262822
NameBDBM50262822
Synonyms:5'-Benzoylamino-2'-methyl-biphenyl-4-carboxylic acid cyclopropylmethyl-amide | CHEMBL478421
TypeSmall organic molecule
Emp. Form.C25H24N2O2
Mol. Mass.384.4703
SMILESCc1ccc(NC(=O)c2ccccc2)cc1-c1ccc(cc1)C(=O)NCC1CC1