Reaction Details
TargetHeat shock protein beta-1
LigandBDBM50263168
Substrate/Competitorn/a
Meas. Tech.ChEMBL_489080 (CHEMBL987300)
IC50 27±n/a nM
Citation Angell, RMAngell, TDBamborough, PBamford, MJChung, CWCockerill, SGFlack, SSJones, KLLaine, DILongstaff, TLudbrook, SPearson, RSmith, KJSmee, PASomers, DOWalker, AL Biphenyl amide p38 kinase inhibitors 4: DFG-in and DFG-out binding modes. Bioorg Med Chem Lett18:4433-7 (2008) 
 
Heat shock protein beta-1
Name:Heat shock protein beta-1
Type:PROTEIN
Mol. Mass.:22781.73
Organism:Homo sapiens (Human)
Description:ChEMBL_1500622
Residue:205
BDBM50263168
NameBDBM50263168
Synonyms:CHEMBL476351 N-{4'-[(cyclopropylmethyl)carbamoyl]-6-methylbiphenyl-3-yl}-2-morpholin-4-ylpyridine-4-carboxamide
TypeSmall organic molecule
Emp. Form.C28H30N4O3
Mol. Mass.470.5628
SMILESCc1ccc(NC(=O)c2ccnc(c2)N2CCOCC2)cc1-c1ccc(cc1)C(=O)NCC1CC1