Reaction Details
TargetHeat shock protein beta-1
LigandBDBM50263093
Substrate/Competitorn/a
Meas. Tech.ChEMBL_489080 (CHEMBL987300)
IC50 53±n/a nM
Citation Angell, RMAngell, TDBamborough, PBamford, MJChung, CWCockerill, SGFlack, SSJones, KLLaine, DILongstaff, TLudbrook, SPearson, RSmith, KJSmee, PASomers, DOWalker, AL Biphenyl amide p38 kinase inhibitors 4: DFG-in and DFG-out binding modes. Bioorg Med Chem Lett18:4433-7 (2008) 
 
Heat shock protein beta-1
Name:Heat shock protein beta-1
Type:PROTEIN
Mol. Mass.:22781.73
Organism:Homo sapiens (Human)
Description:ChEMBL_1500622
Residue:205
BDBM50263093
NameBDBM50263093
Synonyms:6-Methyl-biphenyl-3,4'-dicarboxylic acid 3-cyclopropylamide 4'-cyclopropylmethyl-amide N3-cyclopropyl-N4'-(cyclopropylmethyl)-6-methylbiphenyl-3,4'-dicarboxamide | N~3~-cyclopropyl-N~4~'-(cyclopropylmethyl)-6-methylbiphenyl-3,4'-dicarboxamide
TypeSmall organic molecule
Emp. Form.C22H24N2O2
Mol. Mass.348.4382
SMILESCc1ccc(cc1-c1ccc(cc1)C(=O)NCC1CC1)C(=O)NC1CC1