Reaction Details
TargetSerine/threonine-protein kinase 10
LigandBDBM50263167
Substrate/Competitorn/a
Meas. Tech.ChEMBL_489229 (CHEMBL989976)
IC50>10000±n/a nM
Citation Angell, RMAngell, TDBamborough, PBamford, MJChung, CWCockerill, SGFlack, SSJones, KLLaine, DILongstaff, TLudbrook, SPearson, RSmith, KJSmee, PASomers, DOWalker, AL Biphenyl amide p38 kinase inhibitors 4: DFG-in and DFG-out binding modes. Bioorg Med Chem Lett18:4433-7 (2008) 
 
Serine/threonine-protein kinase 10
Name:Serine/threonine-protein kinase 10
Type:Protein
Mol. Mass.:112139.54
Organism:Homo sapiens (Human)
Description:O94804
Residue:968
BDBM50263167
NameBDBM50263167
Synonyms:3,4,5,6-Tetrahydro-2H-[1,2']bipyridinyl-4'-carboxylic acid [4'-(cyclopropylmethyl-carbamoyl)-6-methyl-biphenyl-3-yl]-amide D3RKN_34
TypeSmall organic molecule
Emp. Form.C29H32N4O2
Mol. Mass.468.59
SMILESCc1ccc(NC(=O)c2ccnc(c2)N2CCCCC2)cc1-c1ccc(cc1)C(=O)NCC1CC1