Reaction Details
TargetAcetylcholinesterase
LigandBDBM50263215
Substrate/Competitorn/a
Meas. Tech.ChEMBL_489450 (CHEMBL982932)
IC50 1.54±n/a nM
Citation Rosini, MSimoni, EBartolini, MCavalli, ACeccarini, LPascu, NMcClymont, DWTarozzi, ABolognesi, MLMinarini, ATumiatti, VAndrisano, VMellor, IRMelchiorre, C Inhibition of acetylcholinesterase, beta-amyloid aggregation, and NMDA receptors in Alzheimer's disease: a promising direction for the multi-target-directed ligands gold rush. J Med Chem51:4381-4 (2008) 
 
Acetylcholinesterase
Name:Acetylcholinesterase
Type:Enzyme
Mol. Mass.:67792.70
Organism:Homo sapiens (Human)
Description:P22303
Residue:614
BDBM50263215
NameBDBM50263215
Synonyms:CHEMBL473866 | N-[5-(9H-Carbazol-4-yloxy)pentyl]-N'-(6-chloro-1,2,3,4-tetrahydroacridin-9-yl)propane-1,3-diamine
TypeSmall organic molecule
Emp. Form.C33H37ClN4O
Mol. Mass.541.126
SMILESClc1ccc2c(NCCCNCCCCCOc3cccc4[nH]c5ccccc5c34)c3CCCCc3nc2c1