Reaction Details
TargetSerine/threonine-protein kinase Chk1
LigandBDBM50263132
Substrate/Competitorn/a
Meas. Tech.ChEMBL_489674 (CHEMBL982978)
IC50>50000±n/a nM
Citation Nathan Tumey, LBoschelli, DHLee, JChaudhary, D 2-Alkenylthieno[2,3-b]pyridine-5-carbonitriles: Potent and selective inhibitors of PKCtheta. Bioorg Med Chem Lett18:4420-3 (2008) 
 
Serine/threonine-protein kinase Chk1
Name:Serine/threonine-protein kinase Chk1
Type:Enzyme Catalytic Domain
Mol. Mass.:54443.02
Organism:Homo sapiens (Human)
Description:gi_166295192
Residue:476
BDBM50263132
NameBDBM50263132
Synonyms:4-(4-methyl-1H-indol-5-ylamino)-2-(3-oxo-3-(pyrrolidin-1-yl)prop-1-enyl)thieno[2,3-b]pyridine-5-carbonitrile | CHEMBL477817
TypeSmall organic molecule
Emp. Form.C24H21N5OS
Mol. Mass.427.521
SMILESCc1c(Nc2c(cnc3sc(\C=C\C(=O)N4CCCC4)cc23)C#N)ccc2[nH]ccc12