Reaction Details
TargetProtein kinase C theta type
LigandBDBM50262606
Substrate/Competitorn/a
Meas. Tech.ChEMBL_489543 (CHEMBL986466)
IC50 3.5±n/a nM
Citation Nathan Tumey, LBoschelli, DHLee, JChaudhary, D 2-Alkenylthieno[2,3-b]pyridine-5-carbonitriles: Potent and selective inhibitors of PKCtheta. Bioorg Med Chem Lett18:4420-3 (2008) 
 
Protein kinase C theta type
Name:Protein kinase C theta type
Type:Serine/threonine-protein kinase
Mol. Mass.:81878.04
Organism:Homo sapiens (Human)
Description:Full-length human PKC theta (Panvera Catalog No. P2996).
Residue:706
BDBM50262606
NameBDBM50262606
Synonyms:3-methyl-4-(4-methyl-1H-indol-5-ylamino)-2-(3-oxo-3-(pyrrolidin-1-yl)prop-1-enyl)thieno[2,3-b]pyridine-5-carbonitrile | CHEMBL479057
TypeSmall organic molecule
Emp. Form.C25H23N5OS
Mol. Mass.441.548
SMILESCc1c(\C=C\C(=O)N2CCCC2)sc2ncc(C#N)c(Nc3ccc4[nH]ccc4c3C)c12