Reaction Details
TargetProtein kinase C delta type
LigandBDBM50262605
Substrate/Competitorn/a
Meas. Tech.ChEMBL_489544 (CHEMBL986467)
IC50 100±n/a nM
Citation Nathan Tumey, LBoschelli, DHLee, JChaudhary, D 2-Alkenylthieno[2,3-b]pyridine-5-carbonitriles: Potent and selective inhibitors of PKCtheta. Bioorg Med Chem Lett18:4420-3 (2008) 
 
Protein kinase C delta type
Name:Protein kinase C delta type
Type:Enzyme
Mol. Mass.:77516.79
Organism:Homo sapiens (Human)
Description:The recombinant human PKC enzymes were produced using a baculovirus expression system in SF9 cells
Residue:676
BDBM50262605
NameBDBM50262605
Synonyms:4-(4-methyl-1H-indol-5-ylamino)-2-(3-(pyrrolidin-1-yl)prop-1-enyl)thieno[2,3-b]pyridine-5-carbonitrile | CHEMBL517677
TypeSmall organic molecule
Emp. Form.C24H23N5S
Mol. Mass.413.538
SMILESCc1c(Nc2c(cnc3sc(\C=C\CN4CCCC4)cc23)C#N)ccc2[nH]ccc12