Reaction Details
TargetProtein kinase C delta type
LigandBDBM50263268
Substrate/Competitorn/a
Meas. Tech.ChEMBL_489544 (CHEMBL986467)
IC50 1800±n/a nM
Citation Nathan Tumey, LBoschelli, DHLee, JChaudhary, D 2-Alkenylthieno[2,3-b]pyridine-5-carbonitriles: Potent and selective inhibitors of PKCtheta. Bioorg Med Chem Lett18:4420-3 (2008) 
 
Protein kinase C delta type
Name:Protein kinase C delta type
Type:Enzyme
Mol. Mass.:77516.79
Organism:Homo sapiens (Human)
Description:The recombinant human PKC enzymes were produced using a baculovirus expression system in SF9 cells
Residue:676
BDBM50263268
NameBDBM50263268
Synonyms:3-(5-cyano-4-(4-methyl-1H-indol-5-ylamino)thieno[2,3-b]pyridin-2-yl)-N-(2-methoxyethyl)acrylamide | CHEMBL476127
TypeSmall organic molecule
Emp. Form.C23H21N5O2S
Mol. Mass.431.51
SMILESCOCCNC(=O)\C=C\c1cc2c(Nc3ccc4[nH]ccc4c3C)c(cnc2s1)C#N