Reaction Details
TargetProtein kinase C delta type
LigandBDBM50263219
Substrate/Competitorn/a
Meas. Tech.ChEMBL_489544 (CHEMBL986467)
IC50 2100±n/a nM
Citation Nathan Tumey, LBoschelli, DHLee, JChaudhary, D 2-Alkenylthieno[2,3-b]pyridine-5-carbonitriles: Potent and selective inhibitors of PKCtheta. Bioorg Med Chem Lett18:4420-3 (2008) 
 
Protein kinase C delta type
Name:Protein kinase C delta type
Type:Enzyme
Mol. Mass.:77516.79
Organism:Homo sapiens (Human)
Description:The recombinant human PKC enzymes were produced using a baculovirus expression system in SF9 cells
Residue:676
BDBM50263219
NameBDBM50263219
Synonyms:3-(5-cyano-4-(4-methyl-1H-indol-5-ylamino)thieno[2,3-b]pyridin-2-yl)-N,N-dimethylacrylamide | CHEMBL513913
TypeSmall organic molecule
Emp. Form.C22H19N5OS
Mol. Mass.401.484
SMILESCN(C)C(=O)\C=C\c1cc2c(Nc3ccc4[nH]ccc4c3C)c(cnc2s1)C#N