Reaction Details
TargetCholecystokinin receptor type A
LigandBDBM50263229
Substrate/Competitorn/a
Meas. Tech.ChEMBL_490133 (CHEMBL994438)
EC50 0.093±n/a nM
Citation Zhu, CHansen, ARBateman, TChen, ZHolt, TGHubert, JAKaranam, BVLee, SJPan, JQian, SReddy, VBReitman, MLStrack, AMTong, VWeingarth, DTWolff, MSMacNeil, DJWeber, AEDuffy, JLEdmondson, SD Discovery of imidazole carboxamides as potent and selective CCK1R agonists. Bioorg Med Chem Lett18:4393-6 (2008) 
 
Cholecystokinin receptor type A
Name:Cholecystokinin receptor type A
Type:G Protein-Coupled Receptor (GPCR)
Mol. Mass.:47859.34
Organism:Homo sapiens (Human)
Description:Stable expression of human CCK-1 receptors in HEK 293 cells.
Residue:428
BDBM50263229
NameBDBM50263229
Synonyms:3-(4-(1-(2,3-dihydrobenzo[b][1,4]dioxin-6-yl)-2-(4-fluorophenyl)-1H-imidazole-4-carbonyl)piperazin-1-yl)-1-naphthoic acid CHEMBL505969
TypeSmall organic molecule
Emp. Form.C33H27FN4O5
Mol. Mass.578.5897
SMILESOC(=O)c1cc(cc2ccccc12)N1CCN(CC1)C(=O)c1cn(c(n1)-c1ccc(F)cc1)-c1ccc2OCCOc2c1