Reaction Details
TargetGastrin/cholecystokinin type B receptor
LigandBDBM50263226
Substrate/Competitorn/a
Meas. Tech.ChEMBL_490136 (CHEMBL994441)
IC50>10000±n/a nM
Citation Zhu, CHansen, ARBateman, TChen, ZHolt, TGHubert, JAKaranam, BVLee, SJPan, JQian, SReddy, VBReitman, MLStrack, AMTong, VWeingarth, DTWolff, MSMacNeil, DJWeber, AEDuffy, JLEdmondson, SD Discovery of imidazole carboxamides as potent and selective CCK1R agonists. Bioorg Med Chem Lett18:4393-6 (2008) 
 
Gastrin/cholecystokinin type B receptor
Name:Gastrin/cholecystokinin type B receptor
Type:G Protein-Coupled Receptor (GPCR)
Mol. Mass.:48445.79
Organism:Homo sapiens (Human)
Description:Stable expression of human CCK-2 receptors in HEK 293 cells.
Residue:447
BDBM50263226
NameBDBM50263226
Synonyms:3-(4-(1-(3-ethoxyphenyl)-2-(4-fluorophenyl)-1H-imidazole-4-carbonyl)piperazin-1-yl)-1-naphthoic acid CHEMBL506201
TypeSmall organic molecule
Emp. Form.C33H29FN4O4
Mol. Mass.564.6062
SMILESCCOc1cccc(c1)-n1cc(nc1-c1ccc(F)cc1)C(=O)N1CCN(CC1)c1cc(C(O)=O)c2ccccc2c1