Reaction Details
TargetGastrin/cholecystokinin type B receptor
LigandBDBM50263184
Substrate/Competitorn/a
Meas. Tech.ChEMBL_490136 (CHEMBL994441)
IC50>10000±n/a nM
Citation Zhu, CHansen, ARBateman, TChen, ZHolt, TGHubert, JAKaranam, BVLee, SJPan, JQian, SReddy, VBReitman, MLStrack, AMTong, VWeingarth, DTWolff, MSMacNeil, DJWeber, AEDuffy, JLEdmondson, SD Discovery of imidazole carboxamides as potent and selective CCK1R agonists. Bioorg Med Chem Lett18:4393-6 (2008) 
 
Gastrin/cholecystokinin type B receptor
Name:Gastrin/cholecystokinin type B receptor
Type:G Protein-Coupled Receptor (GPCR)
Mol. Mass.:48445.79
Organism:Homo sapiens (Human)
Description:Stable expression of human CCK-2 receptors in HEK 293 cells.
Residue:447
BDBM50263184
NameBDBM50263184
Synonyms:(1-(3-ethoxyphenyl)-2-(2-fluorophenyl)-1H-imidazol-4-yl)(4-(quinolin-3-yl)piperazin-1-yl)methanone | CHEMBL515887
TypeSmall organic molecule
Emp. Form.C31H28FN5O2
Mol. Mass.521.5847
SMILESCCOc1cccc(c1)-n1cc(nc1-c1ccccc1F)C(=O)N1CCN(CC1)c1cnc2ccccc2c1