Reaction Details
TargetCholecystokinin receptor type A
LigandBDBM50263225
Substrate/Competitorn/a
Meas. Tech.ChEMBL_490135 (CHEMBL994440)
IC50 0.12±n/a nM
Citation Zhu, CHansen, ARBateman, TChen, ZHolt, TGHubert, JAKaranam, BVLee, SJPan, JQian, SReddy, VBReitman, MLStrack, AMTong, VWeingarth, DTWolff, MSMacNeil, DJWeber, AEDuffy, JLEdmondson, SD Discovery of imidazole carboxamides as potent and selective CCK1R agonists. Bioorg Med Chem Lett18:4393-6 (2008) 
 
Cholecystokinin receptor type A
Name:Cholecystokinin receptor type A
Type:G Protein-Coupled Receptor (GPCR)
Mol. Mass.:47859.34
Organism:Homo sapiens (Human)
Description:Stable expression of human CCK-1 receptors in HEK 293 cells.
Residue:428
BDBM50263225
NameBDBM50263225
Synonyms:(1-(2,3-dihydrobenzo[b][1,4]dioxin-6-yl)-2-(4-fluorophenyl)-1H-imidazol-4-yl)(4-(quinolin-3-yl)piperazin-1-yl)methanone | CHEMBL475679
TypeSmall organic molecule
Emp. Form.C31H26FN5O3
Mol. Mass.535.5682
SMILESFc1ccc(cc1)-c1nc(cn1-c1ccc2OCCOc2c1)C(=O)N1CCN(CC1)c1cnc2ccccc2c1