Reaction Details
TargetCholecystokinin receptor type A
LigandBDBM50263139
Substrate/Competitorn/a
Meas. Tech.ChEMBL_490135 (CHEMBL994440)
IC50 0.56±n/a nM
Citation Zhu, CHansen, ARBateman, TChen, ZHolt, TGHubert, JAKaranam, BVLee, SJPan, JQian, SReddy, VBReitman, MLStrack, AMTong, VWeingarth, DTWolff, MSMacNeil, DJWeber, AEDuffy, JLEdmondson, SD Discovery of imidazole carboxamides as potent and selective CCK1R agonists. Bioorg Med Chem Lett18:4393-6 (2008) 
 
Cholecystokinin receptor type A
Name:Cholecystokinin receptor type A
Type:G Protein-Coupled Receptor (GPCR)
Mol. Mass.:47859.34
Organism:Homo sapiens (Human)
Description:Stable expression of human CCK-1 receptors in HEK 293 cells.
Residue:428
BDBM50263139
NameBDBM50263139
Synonyms:(1-(3-ethoxyphenyl)-2-(2-fluoro-4-methylphenyl)-1H-imidazol-4-yl)(4-(naphthalen-2-yl)piperazin-1-yl)methanone | CHEMBL473664
TypeSmall organic molecule
Emp. Form.C33H31FN4O2
Mol. Mass.534.6232
SMILESCCOc1cccc(c1)-n1cc(nc1-c1ccc(C)cc1F)C(=O)N1CCN(CC1)c1ccc2ccccc2c1