Reaction Details
TargetCholecystokinin receptor type A
LigandBDBM50262861
Substrate/Competitorn/a
Meas. Tech.ChEMBL_490133 (CHEMBL994438)
EC50 0.4±n/a nM
Citation Zhu, CHansen, ARBateman, TChen, ZHolt, TGHubert, JAKaranam, BVLee, SJPan, JQian, SReddy, VBReitman, MLStrack, AMTong, VWeingarth, DTWolff, MSMacNeil, DJWeber, AEDuffy, JLEdmondson, SD Discovery of imidazole carboxamides as potent and selective CCK1R agonists. Bioorg Med Chem Lett18:4393-6 (2008) 
 
Cholecystokinin receptor type A
Name:Cholecystokinin receptor type A
Type:G Protein-Coupled Receptor (GPCR)
Mol. Mass.:47859.34
Organism:Homo sapiens (Human)
Description:Stable expression of human CCK-1 receptors in HEK 293 cells.
Residue:428
BDBM50262861
NameBDBM50262861
Synonyms:3-(4-(1-(3-methoxyphenyl)-2-p-tolyl-1H-imidazole-4-carbonyl)piperazin-1-yl)-2-naphthoic acid | CHEMBL455742
TypeSmall organic molecule
Emp. Form.C33H30N4O4
Mol. Mass.546.6157
SMILESCOc1cccc(c1)-n1cc(nc1-c1ccc(C)cc1)C(=O)N1CCN(CC1)c1cc2ccccc2cc1C(O)=O