Reaction Details
TargetCholecystokinin receptor type A
LigandBDBM50262672
Substrate/Competitorn/a
Meas. Tech.ChEMBL_490135 (CHEMBL994440)
IC50 8±n/a nM
Citation Zhu, CHansen, ARBateman, TChen, ZHolt, TGHubert, JAKaranam, BVLee, SJPan, JQian, SReddy, VBReitman, MLStrack, AMTong, VWeingarth, DTWolff, MSMacNeil, DJWeber, AEDuffy, JLEdmondson, SD Discovery of imidazole carboxamides as potent and selective CCK1R agonists. Bioorg Med Chem Lett18:4393-6 (2008) 
 
Cholecystokinin receptor type A
Name:Cholecystokinin receptor type A
Type:G Protein-Coupled Receptor (GPCR)
Mol. Mass.:47859.34
Organism:Homo sapiens (Human)
Description:Stable expression of human CCK-1 receptors in HEK 293 cells.
Residue:428
BDBM50262672
NameBDBM50262672
Synonyms:(4-(3,4-dichlorophenyl)piperazin-1-yl)(1-(3-methoxyphenyl)-2-p-tolyl-1H-imidazol-4-yl)methanone | CHEMBL476095
TypeSmall organic molecule
Emp. Form.C28H26Cl2N4O2
Mol. Mass.521.438
SMILESCOc1cccc(c1)-n1cc(nc1-c1ccc(C)cc1)C(=O)N1CCN(CC1)c1ccc(Cl)c(Cl)c1