Reaction Details
TargetMitogen-activated protein kinase 14
LigandBDBM50262974
Substrate/Competitorn/a
Meas. Tech.ChEMBL_490152 (CHEMBL983811)
Ki 3±n/a nM
Citation Angell, RAston, NMBamborough, PBuckton, JBCockerill, SdeBoeck, SJEdwards, CDHolmes, DSJones, KLLaine, DIPatel, SSmee, PASmith, KJSomers, DOWalker, AL Biphenyl amide p38 kinase inhibitors 3: Improvement of cellular and in vivo activity. Bioorg Med Chem Lett18:4428-32 (2008) 
 
Mitogen-activated protein kinase 14
Name:Mitogen-activated protein kinase 14
Type:Serine/threonine-protein kinase
Mol. Mass.:41286.76
Organism:Homo sapiens (Human)
Description:Q16539
Residue:360
BDBM50262974
NameBDBM50262974
Synonyms:6-Methyl-biphenyl-3,4'-dicarboxylic acid 3-cyclopropylamide 4'-[4-(4-methyl-piperazin-1-yl)-benzylamide] | CHEMBL516127
TypeSmall organic molecule
Emp. Form.C30H34N4O2
Mol. Mass.482.6166
SMILESCN1CCN(CC1)c1ccc(CNC(=O)c2ccc(cc2)-c2cc(ccc2C)C(=O)NC2CC2)cc1