Reaction Details
TargetMitogen-activated protein kinase 14
LigandBDBM50262918
Substrate/Competitorn/a
Meas. Tech.ChEMBL_490152 (CHEMBL983811)
IC50 10±n/a nM
Citation Angell, RAston, NMBamborough, PBuckton, JBCockerill, SdeBoeck, SJEdwards, CDHolmes, DSJones, KLLaine, DIPatel, SSmee, PASmith, KJSomers, DOWalker, AL Biphenyl amide p38 kinase inhibitors 3: Improvement of cellular and in vivo activity. Bioorg Med Chem Lett18:4428-32 (2008) 
 
Mitogen-activated protein kinase 14
Name:Mitogen-activated protein kinase 14
Type:Serine/threonine-protein kinase
Mol. Mass.:41286.76
Organism:Homo sapiens (Human)
Description:Q16539
Residue:360
BDBM50262918
NameBDBM50262918
Synonyms:6-Methyl-biphenyl-3,4'-dicarboxylic acid 3-cyclopropylamide 4'-(3-methanesulfonylamino-benzylamide) | CHEMBL479028
TypeSmall organic molecule
Emp. Form.C26H27N3O4S
Mol. Mass.477.575
SMILESCc1ccc(cc1-c1ccc(cc1)C(=O)NCc1cccc(NS(C)(=O)=O)c1)C(=O)NC1CC1