Reaction Details
TargetMitogen-activated protein kinase 14
LigandBDBM50262917
Substrate/Competitorn/a
Meas. Tech.ChEMBL_490152 (CHEMBL983811)
IC50 23±n/a nM
Citation Angell, RAston, NMBamborough, PBuckton, JBCockerill, SdeBoeck, SJEdwards, CDHolmes, DSJones, KLLaine, DIPatel, SSmee, PASmith, KJSomers, DOWalker, AL Biphenyl amide p38 kinase inhibitors 3: Improvement of cellular and in vivo activity. Bioorg Med Chem Lett18:4428-32 (2008) 
 
Mitogen-activated protein kinase 14
Name:Mitogen-activated protein kinase 14
Type:Serine/threonine-protein kinase
Mol. Mass.:41286.76
Organism:Homo sapiens (Human)
Description:Q16539
Residue:360
BDBM50262917
NameBDBM50262917
Synonyms:6-Methyl-biphenyl-3,4'-dicarboxylic acid 3-cyclopropylamide 4'-(3-methoxy-benzylamide) | CHEMBL517671
TypeSmall organic molecule
Emp. Form.C26H26N2O3
Mol. Mass.414.4962
SMILESCOc1cccc(CNC(=O)c2ccc(cc2)-c2cc(ccc2C)C(=O)NC2CC2)c1