Reaction Details
TargetMitogen-activated protein kinase 14
LigandBDBM50262916
Substrate/Competitorn/a
Meas. Tech.ChEMBL_490152 (CHEMBL983811)
Ki 7±n/a nM
Citation Angell, RAston, NMBamborough, PBuckton, JBCockerill, SdeBoeck, SJEdwards, CDHolmes, DSJones, KLLaine, DIPatel, SSmee, PASmith, KJSomers, DOWalker, AL Biphenyl amide p38 kinase inhibitors 3: Improvement of cellular and in vivo activity. Bioorg Med Chem Lett18:4428-32 (2008) 
 
Mitogen-activated protein kinase 14
Name:Mitogen-activated protein kinase 14
Type:Serine/threonine-protein kinase
Mol. Mass.:41286.76
Organism:Homo sapiens (Human)
Description:Q16539
Residue:360
BDBM50262916
NameBDBM50262916
Synonyms:6-Methyl-biphenyl-3,4'-dicarboxylic acid 3-cyclopropylamide 4'-[(4-methoxy-phenyl)-amide] | CHEMBL478819
TypeSmall organic molecule
Emp. Form.C25H24N2O3
Mol. Mass.400.4697
SMILESCOc1ccc(NC(=O)c2ccc(cc2)-c2cc(ccc2C)C(=O)NC2CC2)cc1