Reaction Details
TargetMitogen-activated protein kinase 14
LigandBDBM50262866
Substrate/Competitorn/a
Meas. Tech.ChEMBL_490152 (CHEMBL983811)
Ki 32±n/a nM
Citation Angell, RAston, NMBamborough, PBuckton, JBCockerill, SdeBoeck, SJEdwards, CDHolmes, DSJones, KLLaine, DIPatel, SSmee, PASmith, KJSomers, DOWalker, AL Biphenyl amide p38 kinase inhibitors 3: Improvement of cellular and in vivo activity. Bioorg Med Chem Lett18:4428-32 (2008) 
 
Mitogen-activated protein kinase 14
Name:Mitogen-activated protein kinase 14
Type:Serine/threonine-protein kinase
Mol. Mass.:41286.76
Organism:Homo sapiens (Human)
Description:Q16539
Residue:360
BDBM50262866
NameBDBM50262866
Synonyms:CHEMBL477791 | Thiophene-2-carboxylic acid [4'-(cyclopropylmethyl-carbamoyl)-6-methyl-biphenyl-3-yl]-amide
TypeSmall organic molecule
Emp. Form.C23H22N2O2S
Mol. Mass.390.498
SMILESCc1ccc(NC(=O)c2cccs2)cc1-c1ccc(cc1)C(=O)NCC1CC1