Reaction Details
TargetMitogen-activated protein kinase 14
LigandBDBM50262673
Substrate/Competitorn/a
Meas. Tech.ChEMBL_490152 (CHEMBL983811)
Ki 14±n/a nM
Citation Angell, RAston, NMBamborough, PBuckton, JBCockerill, SdeBoeck, SJEdwards, CDHolmes, DSJones, KLLaine, DIPatel, SSmee, PASmith, KJSomers, DOWalker, AL Biphenyl amide p38 kinase inhibitors 3: Improvement of cellular and in vivo activity. Bioorg Med Chem Lett18:4428-32 (2008) 
 
Mitogen-activated protein kinase 14
Name:Mitogen-activated protein kinase 14
Type:Serine/threonine-protein kinase
Mol. Mass.:41286.76
Organism:Homo sapiens (Human)
Description:Q16539
Residue:360
BDBM50262673
NameBDBM50262673
Synonyms:6-Methyl-biphenyl-3,4'-dicarboxylic acid 4'-cyclopropylmethyl-amide 3-thiazol-2-ylamide | CHEMBL478614
TypeSmall organic molecule
Emp. Form.C22H21N3O2S
Mol. Mass.391.486
SMILESCc1ccc(cc1-c1ccc(cc1)C(=O)NCC1CC1)C(=O)Nc1nccs1