Reaction Details
TargetCyclin-dependent kinase 2
LigandBDBM50263112
Substrate/Competitorn/a
Meas. Tech.ChEMBL_490603 (CHEMBL984724)
IC50 6±n/a nM
Citation Finlay, MRActon, DGAndrews, DMBarker, AJDennis, MFisher, EGraham, MAGreen, CPHeaton, DWKaroutchi, GLoddick, SAMorgentin, RRoberts, ATucker, JAWeir, HM Imidazole piperazines: SAR and development of a potent class of cyclin-dependent kinase inhibitors with a novel binding mode. Bioorg Med Chem Lett18:4442-6 (2008) 
 
Cyclin-dependent kinase 2
Name:Cyclin-dependent kinase 2
Type:Enzyme Subunit
Mol. Mass.:33938.17
Organism:Homo sapiens (Human)
Description:P24941
Residue:298
BDBM50263112
NameBDBM50263112
Synonyms:1-(4-(4-(5-fluoro-4-(1-isopropyl-2-methyl-1H-imidazol-5-yl)pyrimidin-2-ylamino)phenyl)piperazin-1-yl)-2-hydroxyethanone | CHEMBL476993
TypeSmall organic molecule
Emp. Form.C23H28FN7O2
Mol. Mass.453.5125
SMILESCC(C)n1c(C)ncc1-c1nc(Nc2ccc(cc2)N2CCN(CC2)C(=O)CO)ncc1F