Reaction Details
TargetCyclin-dependent kinase 2
LigandBDBM50263148
Substrate/Competitorn/a
Meas. Tech.ChEMBL_490603 (CHEMBL984724)
IC50>0.3±n/a nM
Citation Finlay, MRActon, DGAndrews, DMBarker, AJDennis, MFisher, EGraham, MAGreen, CPHeaton, DWKaroutchi, GLoddick, SAMorgentin, RRoberts, ATucker, JAWeir, HM Imidazole piperazines: SAR and development of a potent class of cyclin-dependent kinase inhibitors with a novel binding mode. Bioorg Med Chem Lett18:4442-6 (2008) 
 
Cyclin-dependent kinase 2
Name:Cyclin-dependent kinase 2
Type:Enzyme Subunit
Mol. Mass.:33938.17
Organism:Homo sapiens (Human)
Description:P24941
Residue:298
BDBM50263148
NameBDBM50263148
Synonyms:CHEMBL476578 | N-((R)-1-(4-(5-fluoro-4-(1-isopropyl-2-methyl-1H-imidazol-5-yl)pyrimidin-2-ylamino)phenyl)pyrrolidin-3-yl)acetamide
TypeSmall organic molecule
Emp. Form.C23H28FN7O
Mol. Mass.437.5131
SMILESCC(C)n1c(C)ncc1-c1nc(Nc2ccc(cc2)N2CC[C@H](C2)NC(C)=O)ncc1F