Reaction Details
TargetCalmodulin-sensitive adenylate cyclase
LigandBDBM50262713
Substrate/Competitorn/a
Meas. Tech.ChEMBL_489980 (CHEMBL983795)
IC50 1732±n/a nM
Citation Chen, DMisra, MSower, LPeterson, JWKellogg, GESchein, CH Novel inhibitors of anthrax edema factor. Bioorg Med Chem16:7225-33 (2008) 
 
Calmodulin-sensitive adenylate cyclase
Name:Calmodulin-sensitive adenylate cyclase
Type:PROTEIN
Mol. Mass.:92481.33
Organism:Bacillus anthracis
Description:ChEMBL_606615
Residue:800
BDBM50262713
NameBDBM50262713
Synonyms:4-(3-methoxy-phenyl)-3a,4,5,9b-tetrahydro-3H-cyclopenta[c]quinoline-8-carboxylic acid | CHEMBL477345
TypeSmall organic molecule
Emp. Form.C20H19NO3
Mol. Mass.321.3698
SMILESCOc1cccc(c1)[C@H]1Nc2ccc(cc2[C@@H]2C=CC[C@H]12)C(O)=O