Reaction Details
TargetCalmodulin-sensitive adenylate cyclase
LigandBDBM50262712
Substrate/Competitorn/a
Meas. Tech.ChEMBL_489980 (CHEMBL983795)
IC50 1834±n/a nM
Citation Chen, DMisra, MSower, LPeterson, JWKellogg, GESchein, CH Novel inhibitors of anthrax edema factor. Bioorg Med Chem16:7225-33 (2008) 
 
Calmodulin-sensitive adenylate cyclase
Name:Calmodulin-sensitive adenylate cyclase
Type:PROTEIN
Mol. Mass.:92481.33
Organism:Bacillus anthracis
Description:ChEMBL_606615
Residue:800
BDBM50262712
NameBDBM50262712
Synonyms:3-[(9-oxo-9Hfluorene-1-carbonyl)-amino]-benzoic acid | CHEMBL444116
TypeSmall organic molecule
Emp. Form.C21H13NO4
Mol. Mass.343.3322
SMILESOC(=O)c1cccc(NC(=O)c2cccc3-c4ccccc4C(=O)c23)c1