Reaction Details
TargetTyrosine-protein kinase ABL1
LigandBDBM50262723
Substrate/Competitorn/a
Meas. Tech.ChEMBL_489983 (CHEMBL983798)
Ki 50±n/a nM
Citation Manetti, FFalchi, FCrespan, ESchenone, SMaga, GBotta, M N-(thiazol-2-yl)-2-thiophene carboxamide derivatives as Abl inhibitors identified by a pharmacophore-based database screening of commercially available compounds. Bioorg Med Chem Lett18:4328-31 (2008) 
 
Tyrosine-protein kinase ABL1
Name:Tyrosine-protein kinase ABL1
Type:Enzyme
Mol. Mass.:122897.30
Organism:Homo sapiens (Human)
Description:P00519
Residue:1130
BDBM50262723
NameBDBM50262723
Synonyms:CHEMBL517822 | N-(5-(2,5-dichlorobenzyl)thiazol-2-yl)thiophene-2-carboxamide
TypeSmall organic molecule
Emp. Form.C15H10Cl2N2OS2
Mol. Mass.369.289
SMILESClc1ccc(Cl)c(Cc2cnc(NC(=O)c3cccs3)s2)c1