Reaction Details
TargetBone morphogenetic protein 4
LigandBDBM50262130
Substrate/Competitorn/a
Meas. Tech.ChEMBL_490878 (CHEMBL989154)
IC50 2600±n/a nM
Citation Cuny, GDYu, PBLaha, JKXing, XLiu, JFLai, CSDeng, DYSachidanandan, CBloch, KDPeterson, RT Structure-activity relationship study of bone morphogenetic protein (BMP) signaling inhibitors. Bioorg Med Chem Lett18:4388-92 (2008) 
 
Bone morphogenetic protein 4
Name:Bone morphogenetic protein 4
Type:PROTEIN
Mol. Mass.:46572.96
Organism:Homo sapiens (Human)
Description:ChEMBL_1363193
Residue:408
BDBM50262130
NameBDBM50262130
Synonyms:4-(3-(4-(2-(piperidin-1-yl)ethoxy)phenyl)H-pyrrolo[1,2-a]pyrimidin-8-yl)quinoline | CHEMBL467544
TypeSmall organic molecule
Emp. Form.C29H28N4O
Mol. Mass.448.5588
SMILESC(CN1CCCCC1)Oc1ccc(cc1)-c1cnc2c(ccn2c1)-c1ccnc2ccccc12